﻿"Dividend type","PR index ISIN","PR index CCY market cap","PR index CCY divisor","TR index CCY divisor","ETF/PR index ratio","ETF currency","ETF ISIN","ETF Bloomberg ticker","Dividend cost per share","Dividend cost per share CCY","Underlier ex date","Underlier record date","Underlier payment date","Underlier ISIN","Underlier RIC","Underlier name","Underlier sedol","Underlier Dividend CCY","Dividend FX rate","Gross dividend amount","Net dividend amount","Gross dividend points","Net dividend points","Dividend point difference","ETF NAV","Index composition quantity","Underlier total shares outstanding","Underlier float factor","Underlier cap factor"
"Dividend","CH0100460531","707078230059.00000000","2114511998.00000000","1100842364.00000000","0.18503550","EUR","IE00B5MTWD60","X7PS","0.10762720","EUR","2022-05-23",,,"FR0000131104","BNPP.PA","BNP PARIBAS","7309681","EUR","1.00000000","3.67000000","2.75250000","2.32662890","1.74497170","0.58165720","61.87400000","1340513556.72094000","1234331646.00000000","0.92170000","1.17828340"
"Dividend","CH0100460531","707078230059.00000000","2114511998.00000000","1100842364.00000000","0.18503550","EUR","IE00B5MTWD60","X7PS","0.03858350","EUR","2022-05-23",,,"IT0000072618","ISP.MI","INTESA SANPAOLO","4076836","EUR","1.00000000","0.07890000","0.05838600","0.80199720","0.59347790","0.20851930","61.87400000","21493443313.75530000","19430463305.00000000","0.93880000","1.17828340"
"Dividend","CH0100460531","707078230059.00000000","2114511998.00000000","1100842364.00000000","0.18503550","EUR","IE00B5MTWD60","X7PS","0.01515270","EUR","2022-05-23","2022-05-24","2022-05-25","AT0000652011","ERST.VI","ERSTE GROUP BANK","5289837","EUR","1.00000000","1.60000000","1.16000000","0.29778510","0.21589420","0.08189090","61.87400000","393543804.15417200","429800000.00000000","0.77710000","1.17828340"
"Dividend","CH0100460531","707078230059.00000000","2114511998.00000000","1100842364.00000000","0.18503550","EUR","IE00B5MTWD60","X7PS","0.00637660","EUR","2022-05-23",,,"IT0000072170","FBK.MI","FINECOBANK","BNGN9Z1","EUR","1.00000000","0.39000000","0.28860000","0.13254480","0.09808310","0.03446170","61.87400000","718634774.65481800","609899770.00000000","1.00000000","1.17828340"
"Dividend","CH0100460622","410425832829.00000000","108557037.00000000","68384981.00000000","0.15374270","EUR","IE00B5MTY077","X4PS","0.08741790","EUR","2022-05-23",,,"FR0010313833","AKE.PA","ARKEMA","B0Z5YZ2","EUR","1.00000000","3.00000000","2.25000000","2.27439600","1.70579700","0.56859900","581.26100000","82300563.04330090","74286041.00000000","0.85440000","1.29668460"
"Dividend","CH0100460747","319843922658.00000000","188119363.00000000","102227242.00000000","0.17970610","EUR","IE00B5MTYK77","XFPS","0.02020270","EUR","2022-05-23",,,"NL0006294274","ENX.PA","EURONEXT","BNBNSG0","EUR","1.00000000","1.93000000","1.64050000","0.74947210","0.63705130","0.11242080","305.53990000","73051925.21342380","107106294.00000000","0.74560000","0.91476760"
"Dividend","CH0100460747","319843922658.00000000","188119363.00000000","102227242.00000000","0.17970610","EUR","IE00B5MTYK77","XFPS","0.06867270","EUR","2022-05-23",,,"FR0004125920","AMUN.PA","AMUNDI","BYZR014","EUR","1.00000000","4.10000000","3.07500000","1.52855500","1.14641620","0.38213880","305.53990000","70134339.40555110","203074651.00000000","0.30540000","1.13085250"
"Special Cash Dividend","CH0100460747","319843922658.00000000","188119363.00000000","102227242.00000000","0.17970610","EUR","IE00B5MTYK77","XFPS","0.00000000","EUR","2022-05-23",,,"GB00BNHSJN34","QLT.L","QUILTER","BNHSJN3","GBP","1.18077710","0.20000000","0.20000000","1.72937690","1.72937690","0.00000000","305.53990000","1377606701.06199000","1404105501.00000000","0.86760000","1.13085250"
"Dividend","CH0100460879","1486248784769.00000000","652505957.00000000","408416263.00000000","0.15664230","EUR","IE00B5MJYY16","XDPS","0.00451020","EUR","2022-05-23",,,"IT0003828271","RECI.MI","RECORDATI","B07DRZ5","EUR","1.00000000","0.57000000","0.42180000","0.11074150","0.08194870","0.02879280","356.79350000","126771032.52596700","209125156.00000000","0.48180000","1.25819210"
"Dividend","CH0100460879","1486248784769.00000000","652505957.00000000","408416263.00000000","0.15664230","EUR","IE00B5MJYY16","XDPS","0.00267040","EUR","2022-05-23",,,"IT0004056880","AMPF.MI","AMPLIFON","B14NJ71","EUR","1.00000000","0.26000000","0.19240000","0.06556810","0.04852040","0.01704770","356.79350000","164552283.60567100","226388620.00000000","0.57770000","1.25819210"
"Dividend","CH0100460879","1486248784769.00000000","652505957.00000000","408416263.00000000","0.15664230","EUR","IE00B5MJYY16","XDPS","0.00215260","EUR","2022-05-23",,,"IT0003492391","DIAS.MI","DIASORIN","B234WN9","EUR","1.00000000","1.05000000","0.77700000","0.05285460","0.03911240","0.01374220","356.79350000","32845679.40721480","55948257.00000000","0.46660000","1.25819210"
"Dividend","CH0100460911","1107862133974.00000000","591620763.00000000","376080858.00000000","0.15268190","EUR","IE00B5MJYX09","XNPS","0.02757250","EUR","2022-05-23",,,"IT0003506190","ATL.MI","ATLANTIA","7667163","EUR","1.00000000","0.74000000","0.54760000","0.69456860","0.51398080","0.18058780","285.91060000","555298920.65195600","825783990.00000000","0.61460000","1.09412720"
"Dividend","CH0100460911","1107862133974.00000000","591620763.00000000","376080858.00000000","0.15268190","EUR","IE00B5MJYX09","XNPS","0.00384980","EUR","2022-05-23",,,"NL0000852564","AALB.AS","AALBERTS","B1W8P14","EUR","1.00000000","1.01000000","0.85850000","0.16809530","0.14288100","0.02521430","285.91060000","98464034.65685330","110580102.00000000","0.86730000","1.02667100"
"Special Cash Dividend","CH0100460911","1107862133974.00000000","591620763.00000000","376080858.00000000","0.15268190","EUR","IE00B5MJYX09","XNPS","0.00243940","EUR","2022-05-23",,,"NL0000852564","AALB.AS","AALBERTS","B1W8P14","EUR","1.00000000","0.64000000","0.54400000","0.10651580","0.09053850","0.01597730","285.91060000","98464034.65685330","110580102.00000000","0.86730000","1.02667100"
"Dividend","CH0100460911","1107862133974.00000000","591620763.00000000","376080858.00000000","0.15268190","EUR","IE00B5MJYX09","XNPS","0.00400140","EUR","2022-05-23",,,"FR0014004L86","AM.PA","DASSAULT AVIATION","BMT9L19","EUR","1.00000000","2.49000000","1.86750000","0.10483030","0.07862280","0.02620750","285.91060000","24907553.56601780","83487030.00000000","0.27850000","1.07124020"
"Dividend","CH0100460911","1107862133974.00000000","591620763.00000000","376080858.00000000","0.15268190","EUR","IE00B5MJYX09","XNPS","0.00169540","EUR","2022-05-23",,,"IT0001078911","ITPG.MI","INTERPUMP GRP","5161407","EUR","1.00000000","0.28000000","0.20720000","0.04270810","0.03160400","0.01110410","285.91060000","90239306.28976410","108879294.00000000","0.75750000","1.09412720"
"Dividend","CH0100460952","481896302855.00000000","765923322.00000000","378247870.00000000","0.19554850","EUR","IE00B5MTXJ97","XIPS","0.09225830","EUR","2022-05-23",,,"IT0000062072","GASI.MI","ASSICURAZIONI GENERALI","4056719","EUR","1.00000000","1.07000000","0.79180000","1.81458720","1.34279460","0.47179260","123.03330000","1298910924.78611000","1581069241.00000000","0.72560000","1.13222100"
"Dividend","CH0100460952","481896302855.00000000","765923322.00000000","378247870.00000000","0.19554850","EUR","IE00B5MTXJ97","XIPS","0.02150190","EUR","2022-05-23","2022-05-24","2022-06-15","NL0010773842","NN.AS","NN GROUP","BNG8PQ9","EUR","1.00000000","1.56000000","1.32600000","0.73304610","0.62308920","0.10995690","123.03330000","359908384.80441000","317878210.00000000","1.00000000","1.13222100"
"Dividend","CH0100461042","625508824400.00000000","559282715.00000000","263956172.00000000","0.20500490","EUR","IE00B5MTWH09","XEPS","0.12914670","EUR","2022-05-23",,,"IT0003132476","ENI.MI","ENI","7145056","EUR","1.00000000","0.43000000","0.31820000","2.42295690","1.79298810","0.62996880","229.27960000","3151437022.72865000","3605594848.00000000","0.69670000","1.25454400"
"Dividend","CH0100461042","625508824400.00000000","559282715.00000000","263956172.00000000","0.20500490","EUR","IE00B5MTWH09","XEPS","0.00000000","EUR","2022-05-23",,,"LU0156801721","TENR.MI","TENARIS","7538515","USD","0.94714910","0.28000000","0.28000000","0.27775180","0.27775180","0.00000000","229.27960000","585749499.45635800","1180536830.00000000","0.39550000","1.25454400"
"Dividend","CH0100461083","792356941523.00000000","225649211.00000000","136139729.00000000","0.15769460","EUR","IE00B5MTZ595","XQPS","0.02737840","EUR","2022-05-23",,,"IT0004965148","MONC.MI","MONCLER","BGLP232","EUR","1.00000000","0.60000000","0.44400000","0.66775520","0.49413890","0.17361630","553.73670000","251130741.13104700","273682790.00000000","0.80120000","1.14527940"
"Dividend","CH0100461216","613208580267.00000000","787426617.00000000","614359235.00000000","0.12419460","EUR","IE00B5MTWZ80","X8PS","0.00617460","EUR","2022-05-23",,,"FR0014003TT8","DAST.PA","DASSAULT SYSTEMS","BM8H5Y5","EUR","1.00000000","0.17000000","0.12750000","0.19886970","0.14915230","0.04971740","96.71660000","921149016.16777600","1333925960.00000000","0.53730000","1.28523140"
"Dividend","CH0100461216","613208580267.00000000","787426617.00000000","614359235.00000000","0.12419460","EUR","IE00B5MTWZ80","X8PS","0.00097870","EUR","2022-05-23",,,"IT0005282865","REY.MI","REPLY","BZ1DZ96","EUR","1.00000000","0.80000000","0.59200000","0.03030890","0.02242860","0.00788030","96.71660000","29832567.44547650","37411428.00000000","0.60250000","1.32351630"
"Dividend","CH0100461265","302076187748.00000000","667957536.00000000","295188989.00000000","0.22066050","EUR","IE00B5MJYB88","XKPS","0.01042810","EUR","2022-05-23",,,"IT0005090300","INWT.MI","INWIT","BZ0P4R4","EUR","1.00000000","0.32250000","0.23865000","0.18176340","0.13450500","0.04725840","99.79150000","376465940.97690600","960200000.00000000","0.36630000","1.07035310"
"Dividend","CH0100461349","406541879199.00000000","352996880.00000000","154062595.00000000","0.22418800","EUR","IE00B5MTXK03","X6PS","0.02704350","EUR","2022-05-23",,,"IT0005211237","IG.MI","ITALGAS","BD2Z8S7","EUR","1.00000000","0.29500000","0.21830000","0.46395620","0.34332760","0.12062860","258.19510000","555169796.35820000","809768354.00000000","0.60490000","1.13339540"
"Dividend","CH0100461349","406541879199.00000000","352996880.00000000","154062595.00000000","0.22418800","EUR","IE00B5MTXK03","X6PS","0.02650220","EUR","2022-05-23",,,"IT0001233417","A2.MI","A2A","5499131","EUR","1.00000000","0.09040000","0.06689600","0.45467000","0.33645580","0.11821420","258.19510000","1775410214.79376000","3132905277.00000000","0.50000000","1.13339540"
"Dividend","CH0009107191","1298840233111.00000000","2641371665.00000000","1258065439.00000000","0.20200210","EUR","IE00B60SX063","SDJMID","0.00746780","EUR","2022-05-23",,,"IT0003506190","ATL.MI","ATLANTIA","7667163","EUR","1.00000000","0.74000000","0.54760000","0.14218740","0.10521870","0.03696870","99.33050000","507526840.25400000","825783990.00000000","0.61460000","1.00000000"
"Dividend","CH0009107191","1298840233111.00000000","2641371665.00000000","1258065439.00000000","0.20200210","EUR","IE00B60SX063","SDJMID","0.01123890","EUR","2022-05-23","2022-05-24","2022-05-25","AT0000652011","ERST.VI","ERSTE GROUP BANK","5289837","EUR","1.00000000","1.60000000","1.16000000","0.20231770","0.14668030","0.05563740","99.33050000","333997580.00000000","429800000.00000000","0.77710000","1.00000000"
"Dividend","CH0009107191","1298840233111.00000000","2641371665.00000000","1258065439.00000000","0.20200210","EUR","IE00B60SX063","SDJMID","0.00261600","EUR","2022-05-23",,,"IT0004965148","MONC.MI","MONCLER","BGLP232","EUR","1.00000000","0.60000000","0.44400000","0.04980930","0.03685890","0.01295040","99.33050000","219274651.34800000","273682790.00000000","0.80120000","1.00000000"
"Dividend","CH0009107191","1298840233111.00000000","2641371665.00000000","1258065439.00000000","0.20200210","EUR","IE00B60SX063","SDJMID","0.00472960","EUR","2022-05-23",,,"IT0000072170","FBK.MI","FINECOBANK","BNGN9Z1","EUR","1.00000000","0.39000000","0.28860000","0.09005200","0.06663850","0.02341350","99.33050000","609899770.00000000","609899770.00000000","1.00000000","1.00000000"
"Dividend","CH0009107191","1298840233111.00000000","2641371665.00000000","1258065439.00000000","0.20200210","EUR","IE00B60SX063","SDJMID","0.00000000","EUR","2022-05-23",,,"LU0156801721","TENR.MI","TENARIS","7538515","USD","0.94714910","0.28000000","0.28000000","0.04687840","0.04687840","0.00000000","99.33050000","466902316.26500000","1180536830.00000000","0.39550000","1.00000000"
"Dividend","CH0009107191","1298840233111.00000000","2641371665.00000000","1258065439.00000000","0.20200210","EUR","IE00B60SX063","SDJMID","0.00364040","EUR","2022-05-23",,,"FR0010313833","AKE.PA","ARKEMA","B0Z5YZ2","EUR","1.00000000","3.00000000","2.25000000","0.07208750","0.05406570","0.01802180","99.33050000","63469993.43040000","74286041.00000000","0.85440000","1.00000000"
"Dividend","CH0009107191","1298840233111.00000000","2641371665.00000000","1258065439.00000000","0.20200210","EUR","IE00B60SX063","SDJMID","0.00176810","EUR","2022-05-23",,,"NL0006294274","ENX.PA","EURONEXT","BNBNSG0","EUR","1.00000000","1.93000000","1.64050000","0.05835110","0.04959840","0.00875270","99.33050000","79858452.80640000","107106294.00000000","0.74560000","1.00000000"
"Dividend","CH0009107191","1298840233111.00000000","2641371665.00000000","1258065439.00000000","0.20200210","EUR","IE00B60SX063","SDJMID","0.00114190","EUR","2022-05-23",,,"IT0003828271","RECI.MI","RECORDATI","B07DRZ5","EUR","1.00000000","0.57000000","0.42180000","0.02174290","0.01608980","0.00565310","99.33050000","100756500.16080000","209125156.00000000","0.48180000","1.00000000"
"Dividend","CH0009107191","1298840233111.00000000","2641371665.00000000","1258065439.00000000","0.20200210","EUR","IE00B60SX063","SDJMID","0.00067610","EUR","2022-05-23",,,"IT0004056880","AMPF.MI","AMPLIFON","B14NJ71","EUR","1.00000000","0.26000000","0.19240000","0.01287360","0.00952650","0.00334710","99.33050000","130784705.77400000","226388620.00000000","0.57770000","1.00000000"
"Dividend","CH0009107191","1298840233111.00000000","2641371665.00000000","1258065439.00000000","0.20200210","EUR","IE00B60SX063","SDJMID","0.00486160","EUR","2022-05-23",,,"FR0004125920","AMUN.PA","AMUNDI","BYZR014","EUR","1.00000000","4.10000000","3.07500000","0.09626740","0.07220050","0.02406690","99.33050000","62018998.41540000","203074651.00000000","0.30540000","1.00000000"
"Dividend","CH0009107639","595391361146.00000000","1829948790.00000000","891661453.00000000","0.19758710","EUR","IE00B60SWZ49","SDJSML","0.00156880","EUR","2022-05-23",,,"NL0000852564","AALB.AS","AALBERTS","B1W8P14","EUR","1.00000000","1.01000000","0.85850000","0.05293330","0.04499330","0.00794000","64.28700000","95906122.46460000","110580102.00000000","0.86730000","1.00000000"
"Special Cash Dividend","CH0009107639","595391361146.00000000","1829948790.00000000","891661453.00000000","0.19758710","EUR","IE00B60SWZ49","SDJSML","0.00099410","EUR","2022-05-23",,,"NL0000852564","AALB.AS","AALBERTS","B1W8P14","EUR","1.00000000","0.64000000","0.54400000","0.03354190","0.02851060","0.00503130","64.28700000","95906122.46460000","110580102.00000000","0.86730000","1.00000000"
"Dividend","CH0009107639","595391361146.00000000","1829948790.00000000","891661453.00000000","0.19758710","EUR","IE00B60SWZ49","SDJSML","0.00156280","EUR","2022-05-23",,,"FR0014004L86","AM.PA","DASSAULT AVIATION","BMT9L19","EUR","1.00000000","2.49000000","1.86750000","0.03163770","0.02372830","0.00790940","64.28700000","23251137.85500000","83487030.00000000","0.27850000","1.00000000"
"Dividend","CH0009107639","595391361146.00000000","1829948790.00000000","891661453.00000000","0.19758710","EUR","IE00B60SWZ49","SDJSML","0.00318440","EUR","2022-05-23",,,"IT0005090300","INWT.MI","INWIT","BZ0P4R4","EUR","1.00000000","0.32250000","0.23865000","0.06198540","0.04586920","0.01611620","64.28700000","351721260.00000000","960200000.00000000","0.36630000","1.00000000"
"Dividend","CH0009107639","595391361146.00000000","1829948790.00000000","891661453.00000000","0.19758710","EUR","IE00B60SWZ49","SDJSML","0.00064830","EUR","2022-05-23",,,"IT0001078911","ITPG.MI","INTERPUMP GRP","5161407","EUR","1.00000000","0.28000000","0.20720000","0.01261960","0.00933850","0.00328110","64.28700000","82476065.20500000","108879294.00000000","0.75750000","1.00000000"
"Dividend","CH0009107639","595391361146.00000000","1829948790.00000000","891661453.00000000","0.19758710","EUR","IE00B60SWZ49","SDJSML","0.00076950","EUR","2022-05-23",,,"IT0003492391","DIAS.MI","DIASORIN","B234WN9","EUR","1.00000000","1.05000000","0.77700000","0.01497900","0.01108440","0.00389460","64.28700000","26105456.71620000","55948257.00000000","0.46660000","1.00000000"
"Dividend","CH0009107639","595391361146.00000000","1829948790.00000000","891661453.00000000","0.19758710","EUR","IE00B60SWZ49","SDJSML","0.00405660","EUR","2022-05-23",,,"IT0005211237","IG.MI","ITALGAS","BD2Z8S7","EUR","1.00000000","0.29500000","0.21830000","0.07896370","0.05843310","0.02053060","64.28700000","489828877.33460000","809768354.00000000","0.60490000","1.00000000"
"Dividend","CH0009107639","595391361146.00000000","1829948790.00000000","891661453.00000000","0.19758710","EUR","IE00B60SWZ49","SDJSML","0.00050620","EUR","2022-05-23",,,"IT0005282865","REY.MI","REPLY","BZ1DZ96","EUR","1.00000000","0.80000000","0.59200000","0.00985400","0.00729200","0.00256200","64.28700000","22540385.37000000","37411428.00000000","0.60250000","1.00000000"
"Dividend","CH0009107639","595391361146.00000000","1829948790.00000000","891661453.00000000","0.19758710","EUR","IE00B60SWZ49","SDJSML","0.00397540","EUR","2022-05-23",,,"IT0001233417","A2.MI","A2A","5499131","EUR","1.00000000","0.09040000","0.06689600","0.07738320","0.05726360","0.02011960","64.28700000","1566452638.50000000","3132905277.00000000","0.50000000","1.00000000"
"Special Cash Dividend","CH0009107639","595391361146.00000000","1829948790.00000000","891661453.00000000","0.19758710","EUR","IE00B60SWZ49","SDJSML","0.00000000","EUR","2022-05-23",,,"GB00BNHSJN34","QLT.L","QUILTER","BNHSJN3","GBP","1.18077710","0.20000000","0.20000000","0.15720930","0.15720930","0.00000000","64.28700000","1218201932.66760000","1404105501.00000000","0.86760000","1.00000000"
"Dividend","CH0124017366","407556311590.00000000","1307729660.00000000","708113747.00000000","0.17848930","EUR","IE00B3Q19T94","S7XE","0.16246550","EUR","2022-05-23",,,"FR0000131104","BNPP.PA","BNP PARIBAS","7309681","EUR","1.00000000","3.67000000","2.75250000","3.64090210","2.73067660","0.91022550","55.62620000","1297361222.39592000","1234331646.00000000","0.92170000","1.14035340"
"Dividend","CH0124017366","407556311590.00000000","1307729660.00000000","708113747.00000000","0.17848930","EUR","IE00B3Q19T94","S7XE","0.05824250","EUR","2022-05-23",,,"IT0000072618","ISP.MI","INTESA SANPAOLO","4076836","EUR","1.00000000","0.07890000","0.05838600","1.25503180","0.92872350","0.32630830","55.62620000","20801550085.95390000","19430463305.00000000","0.93880000","1.14035340"
"Dividend","CH0124017366","407556311590.00000000","1307729660.00000000","708113747.00000000","0.17848930","EUR","IE00B3Q19T94","S7XE","0.01778240","EUR","2022-05-23","2022-05-24","2022-05-25","AT0000652011","ERST.VI","ERSTE GROUP BANK","5289837","EUR","1.00000000","1.60000000","1.16000000","0.36228150","0.26265410","0.09962740","55.62620000","296103951.36061600","429800000.00000000","0.77710000","0.88654520"
"Dividend","CH0124017366","407556311590.00000000","1307729660.00000000","708113747.00000000","0.17848930","EUR","IE00B3Q19T94","S7XE","0.00835840","EUR","2022-05-23",,,"IT0000072170","FBK.MI","FINECOBANK","BNGN9Z1","EUR","1.00000000","0.39000000","0.28860000","0.18010930","0.13328090","0.04682840","55.62620000","603933974.40976800","609899770.00000000","1.00000000","0.99021840"
"Dividend","CH0100460531","709788492418.00000000","2114511998.00000000","1100842364.00000000","0.18414460","EUR","IE00B5MTWD60","X7PS","0.01118700","EUR","2022-05-20",,,"DE0005140008","DBKGn.DE","DEUTSCHE BANK","5750355","EUR","1.00000000","0.20000000","0.14725000","0.23033630","0.16958510","0.06075120","61.81180000","2435244471.82333000","2066773131.00000000","1.00000000","1.17828340"
"Dividend","CH0100460671","314778308972.00000000","115825022.00000000","70533396.00000000","0.15592830","EUR","IE00B5MTY309","XOPS","0.01715650","EUR","2022-05-20",,,"FR0012757854","SPIE.PA","SPIE","BYZFYS3","EUR","1.00000000","0.47000000","0.35250000","0.44011330","0.33008500","0.11002830","423.76800000","108459861.01788600","162655622.00000000","0.87740000","0.75998030"
"Dividend","CH0100460838","704003990014.00000000","236904393.00000000","147351682.00000000","0.14880750","EUR","IE00B5MTYL84","X3PS","0.01557450","EUR","2022-05-20","2022-05-23","2022-05-31","NO0003054108","MOWI.OL","MOWI","B02L486","NOK","0.09730940","1.44000000","1.08000000","0.41864870","0.31398660","0.10466210","442.20810000","707791933.82319200","517111091.00000000","0.87880000","1.55751310"
"Special Cash Dividend","CH0100460838","704003990014.00000000","236904393.00000000","147351682.00000000","0.14880750","EUR","IE00B5MTYL84","X3PS","0.00551600","EUR","2022-05-20","2022-05-23","2022-05-31","NO0003054108","MOWI.OL","MOWI","B02L486","NOK","0.09730940","0.51000000","0.38250000","0.14827140","0.11120360","0.03706780","442.20810000","707791933.82319200","517111091.00000000","0.87880000","1.55751310"
"Dividend","CH0100460952","493590313735.00000000","766826886.00000000","379163758.00000000","0.19051970","EUR","IE00B5MTXJ97","XIPS","0.02037420","EUR","2022-05-20",,,"FR0010411983","SCOR.PA","SCOR","B1LB9P6","EUR","1.00000000","1.80000000","1.35000000","0.42776130","0.32082100","0.10694030","122.63370000","182232721.10620200","187097626.00000000","0.91570000","1.06366500"
"Dividend","CH0100461216","615573162707.00000000","787895492.00000000","616155932.00000000","0.12300280","EUR","IE00B5MTWZ80","X8PS","0.00308220","EUR","2022-05-20",,,"DE0005089031","UTDI.DE","UNITED INTERNET","4354134","EUR","1.00000000","0.50000000","0.36812500","0.09500670","0.06994870","0.02505800","96.10090000","149710752.24900000","194000000.00000000","0.49740000","1.55147750"
"Dividend","CH0009107191","1314275161751.00000000","2641371665.00000000","1258725703.00000000","0.19795010","EUR","IE00B60SX063","SDJMID","0.00119300","EUR","2022-05-20","2022-05-23","2022-05-31","NO0003054108","MOWI.OL","MOWI","B02L486","NOK","0.09730940","1.44000000","1.08000000","0.02410800","0.01808100","0.00602700","98.49400000","454437226.77080000","517111091.00000000","0.87880000","1.00000000"
"Special Cash Dividend","CH0009107191","1314275161751.00000000","2641371665.00000000","1258725703.00000000","0.19795010","EUR","IE00B60SX063","SDJMID","0.00042250","EUR","2022-05-20","2022-05-23","2022-05-31","NO0003054108","MOWI.OL","MOWI","B02L486","NOK","0.09730940","0.51000000","0.38250000","0.00853830","0.00640370","0.00213460","98.49400000","454437226.77080000","517111091.00000000","0.87880000","1.00000000"
"Dividend","CH0009107191","1314275161751.00000000","2641371665.00000000","1258725703.00000000","0.19795010","EUR","IE00B60SX063","SDJMID","0.00000000","EUR","2022-05-20",,,"DE000LEG1110","LEGn.DE","LEG IMMOBILIEN","B9G6L89","EUR","1.00000000","4.07000000","4.07000000","0.11223610","0.11223610","0.00000000","98.49400000","72839625.00000000","72839625.00000000","1.00000000","1.00000000"
"Dividend","CH0009107191","1314275161751.00000000","2641371665.00000000","1258725703.00000000","0.19795010","EUR","IE00B60SX063","SDJMID","0.00577780","EUR","2022-05-20",,,"FR0010411983","SCOR.PA","SCOR","B1LB9P6","EUR","1.00000000","1.80000000","1.35000000","0.11675200","0.08756400","0.02918800","98.49400000","171325296.12820000","187097626.00000000","0.91570000","1.00000000"