﻿"Dividend type","PR index ISIN","PR index CCY market cap","PR index CCY divisor","TR index CCY divisor","ETF/PR index ratio","ETF currency","ETF ISIN","ETF Bloomberg ticker","Dividend cost per share","Dividend cost per share CCY","Underlier ex date","Underlier record date","Underlier payment date","Underlier ISIN","Underlier RIC","Underlier name","Underlier sedol","Underlier Dividend CCY","Dividend FX rate","Gross dividend amount","Net dividend amount","Gross dividend points","Net dividend points","Dividend point difference","ETF NAV","Index composition quantity","Underlier total shares outstanding","Underlier float factor","Underlier cap factor"
"Special Cash Dividend","CH0100460747","262840411734.00000000","170671855.00000000","96653839.00000000","0.17078820","EUR","IE00B5MTYK77","XFPS","0.05464380","EUR","2020-08-25",,,"SE0014684528","KINVb.ST","KINNEVIK B","BN2C4W4","SEK","0.09644830","7.00000000","4.90000000","1.06650240","0.74655160","0.31995080","263.01890000","269606966.81468400","241911206.00000000","1.00000000","1.11448730"
"Special Cash Dividend","CH0009107191","1171638965102.00000000","2630931783.00000000","1298423151.00000000","0.19447580","EUR","IE00B60SX063","SDJMID","0.00362180","EUR","2020-08-25",,,"SE0014684528","KINVb.ST","KINNEVIK B","BN2C4W4","SEK","0.09644830","7.00000000","4.90000000","0.06207820","0.04345470","0.01862350","86.60590000","241911206.00000000","241911206.00000000","1.00000000","1.00000000"
"Dividend","CH0100460622","383968866870.00000000","115134801.00000000","75285565.00000000","0.14792590","EUR","IE00B5MTY077","X4PS","0.01990840","EUR","2020-08-21","2020-08-24","2020-08-25","BE0974320526","UMI.BR","UMICORE","BF44466","EUR","1.00000000","0.25000000","0.17500000","0.44861300","0.31402910","0.13458390","493.32540000","206603892.26400000","246400000.00000000","0.82500000","1.01635130"
"Dividend","CH0100460952","418888543671.00000000","797253382.00000000","422019256.00000000","0.18273300","EUR","IE00B5MTXJ97","XIPS","0.00429790","EUR","2020-08-21","2020-08-24","2020-09-18","NL0000303709","AEGN.AS","AEGON","5927375","EUR","1.00000000","0.06000000","0.05100000","0.15680130","0.13328110","0.02352020","96.00970000","2083505829.47707000","2105138885.00000000","0.86290000","1.14697380"
"Dividend","CH0009107191","1155965250180.00000000","2630931783.00000000","1298567185.00000000","0.19446290","EUR","IE00B60SX063","SDJMID","0.00112690","EUR","2020-08-21","2020-08-24","2020-08-25","BE0974320526","UMI.BR","UMICORE","BF44466","EUR","1.00000000","0.25000000","0.17500000","0.01931640","0.01352140","0.00579500","85.44120000","203280000.00000000","246400000.00000000","0.82500000","1.00000000"
"Dividend","CH0009107191","1155965250180.00000000","2630931783.00000000","1298567185.00000000","0.19446290","EUR","IE00B60SX063","SDJMID","0.00120840","EUR","2020-08-21","2020-08-24","2020-09-18","NL0000303709","AEGN.AS","AEGON","5927375","EUR","1.00000000","0.06000000","0.05100000","0.04142690","0.03521290","0.00621400","85.44120000","1816524343.86650000","2105138885.00000000","0.86290000","1.00000000"
"Dividend","CH0100460572","225613129910.00000000","114209441.00000000","63236355.00000000","0.17467440","EUR","IE00B5MTWY73","XPPS","0.00000000","EUR","2020-08-20","2020-08-21","2020-09-25","GB00B1XZS820","AAL.L","ANGLO AMERICAN","B1XZS82","USD","0.84030090","0.28000000","0.28000000","2.73697060","2.73697060","0.00000000","345.05700000","1328554217.10719000","1363118080.00000000","0.90090000","1.08185540"
"Dividend","CH0100460572","225613129910.00000000","114209441.00000000","63236355.00000000","0.17467440","EUR","IE00B5MTWY73","XPPS","0.00000000","EUR","2020-08-20","2020-08-21","2020-09-29","GB00B1CRLC47","MNDI.L","MONDI","B1CRLC4","EUR","1.00000000","0.48750000","0.48750000","2.17443110","2.17443110","0.00000000","345.05700000","509416538.82307900","485553780.00000000","0.93050000","1.12750720"
"Dividend","CH0100460572","225613129910.00000000","114209441.00000000","63236355.00000000","0.17467440","EUR","IE00B5MTWY73","XPPS","0.00000000","EUR","2020-08-20",,,"GB00B71N6K86","EVRE.L","EVRAZ","B71N6K8","USD","0.84030090","0.20000000","0.20000000","0.96632010","0.96632010","0.00000000","345.05700000","656686635.42145400","1506527294.00000000","0.38660000","1.12750720"
"Dividend","CH0100460622","389108192335.00000000","115134801.00000000","75298981.00000000","0.14790040","EUR","IE00B5MTY077","X4PS","0.00000000","EUR","2020-08-20","2020-08-21","2020-10-01","GB00BJFFLV09","CRDA.L","CRODA INTERNATIONAL","BJFFLV0","GBP","1.10784920","0.39500000","0.39500000","0.60213690","0.60213690","0.00000000","499.84280000","158425136.97041400","131906881.00000000","1.00000000","1.20103770"
"Dividend","CH0100460747","264893974269.00000000","170671855.00000000","96835716.00000000","0.17047310","EUR","IE00B5MTYK77","XFPS","0.00000000","EUR","2020-08-20","2020-08-21","2020-09-22","GB00B0SWJX34","LSE.L","LONDON STOCK EXCHANGE","B0SWJX3","GBP","1.10784920","0.23300000","0.23300000","0.31171420","0.31171420","0.00000000","264.58630000","206101883.30128500","351447122.00000000","0.89830000","0.65283070"
"Dividend","CH0100460747","264893974269.00000000","170671855.00000000","96835716.00000000","0.17047310","EUR","IE00B5MTYK77","XFPS","0.00000000","EUR","2020-08-20","2020-08-21","2020-09-29","GB00BF8Q6K64","SLA.L","STANDARD LIFE ABERDEEN","BF8Q6K6","GBP","1.10784920","0.07300000","0.07300000","1.21341500","1.21341500","0.00000000","264.58630000","2560753452.04218000","2281362920.00000000","1.00000000","1.12246650"
"Dividend","CH0100460747","264893974269.00000000","170671855.00000000","96835716.00000000","0.17047310","EUR","IE00B5MTYK77","XFPS","0.00000000","EUR","2020-08-20",,,"GB00BKFB1C65","MNG.L","M&G","BKFB1C6","GBP","1.10784920","0.06000000","0.06000000","1.07884460","1.07884460","0.00000000","264.58630000","2770058295.50658000","2599906866.00000000","0.94920000","1.12246650"
"Dividend","CH0100460747","264893974269.00000000","170671855.00000000","96835716.00000000","0.17047310","EUR","IE00B5MTYK77","XFPS","0.00000000","EUR","2020-08-20","2020-08-21","2020-09-24","GB0002405495","SDR.L","SCHRODERS","0240549","GBP","1.10784920","0.35000000","0.35000000","0.31112000","0.31112000","0.00000000","264.58630000","136943405.27790300","226022400.00000000","0.56850000","1.06575940"
"Dividend","CH0100460838","591891541789.00000000","229790232.00000000","146718454.00000000","0.15147190","EUR","IE00B5MTYL84","X3PS","0.00617570","EUR","2020-08-20",,,"IE0000669501","GL9.I","GLANBIA","4058629","EUR","1.00000000","0.10680000","0.08010000","0.16308430","0.12231320","0.04077110","390.15980000","350891146.80967900","296045684.00000000","0.68490000","1.73055940"
"Dividend","CH0100460879","1291919510352.00000000","637166896.00000000","412770370.00000000","0.14931570","EUR","IE00B5MJYY16","XDPS","0.00000000","EUR","2020-08-20","2020-08-21","2020-09-21","GB00B0LCW083","HIK.L","HIKMA PHARMACEUTICALS","B0LCW08","USD","0.84030090","0.16000000","0.16000000","0.03998000","0.03998000","0.00000000","302.75260000","189470390.63944900","242543355.00000000","0.58770000","1.32921820"
"Dividend","CH0100460911","963038600009.00000000","582395410.00000000","380992700.00000000","0.14785960","EUR","IE00B5MJYX09","XNPS","0.00000000","EUR","2020-08-20","2020-08-21","2020-09-25","GB00BVFNZH21","ROR.L","ROTORK","BVFNZH2","GBP","1.10784920","0.03900000","0.03900000","0.05238510","0.05238510","0.00000000","244.49770000","706122938.11794200","872677658.00000000","1.00000000","0.80914520"
"Dividend","CH0100460952","423365043840.00000000","797253382.00000000","422092926.00000000","0.18269990","EUR","IE00B5MTXJ97","XIPS","0.00000000","EUR","2020-08-20","2020-08-21","2020-09-28","GB0007099541","PRU.L","PRUDENTIAL","0709954","USD","0.84030090","0.05370000","0.05370000","0.09268330","0.09268330","0.00000000","97.01910000","1637528916.00534000","2608857398.00000000","1.00000000","0.62768050"
"Dividend","CH0100461083","694065762606.00000000","211026132.00000000","133130528.00000000","0.15332700","EUR","IE00B5MTZ595","XQPS","0.00000000","EUR","2020-08-20","2020-08-21","2020-09-29","GB00B24CGK77","RB.L","RECKITT BENCKISER GRP","B24CGK7","GBP","1.10784920","0.73000000","0.73000000","2.34843650","2.34843650","0.00000000","504.29250000","612789829.92269200","736535179.00000000","1.00000000","0.83198990"
"Dividend","CH0100461083","694065762606.00000000","211026132.00000000","133130528.00000000","0.15332700","EUR","IE00B5MTZ595","XQPS","0.00000000","EUR","2020-08-20","2020-08-21","2020-09-30","GB0004544929","IMB.L","IMPERIAL BRANDS","0454492","GBP","1.10784920","0.20850000","0.20850000","1.17946790","1.17946790","0.00000000","504.29250000","1077545625.05982000","1020697238.00000000","0.92720000","1.13858460"
"Dividend","CH0100461083","694065762606.00000000","211026132.00000000","133130528.00000000","0.15332700","EUR","IE00B5MTZ595","XQPS","0.00000000","EUR","2020-08-20","2020-08-21","2020-09-11","GB00B02L3W35","BKGH.L","BERKELEY GRP HLDG","B02L3W3","GBP","1.10784920","1.07000000","1.07000000","0.80397070","0.80397070","0.00000000","504.29250000","143123849.00895900","136648882.00000000","0.91990000","1.13858460"
"Dividend","CH0100461174","261217879400.00000000","223450325.00000000","137079472.00000000","0.15765690","EUR","IE00B5MTZM66","XRPS","0.00593120","EUR","2020-08-20","2020-08-21","2020-09-28","LU1072616219","BMEB.L","B&M EUROPEAN VALUE RETAIL","BMTRW10","GBP","1.10784920","0.05400000","0.04590000","0.25080640","0.21318550","0.03762090","184.30410000","936796436.11904800","1000582898.00000000","0.85020000","1.10121230"
"Dividend","CH0009107191","1170120969183.00000000","2630931783.00000000","1299781244.00000000","0.19427670","EUR","IE00B60SX063","SDJMID","0.00000000","EUR","2020-08-20","2020-08-21","2020-10-01","GB00BJFFLV09","CRDA.L","CRODA INTERNATIONAL","BJFFLV0","GBP","1.10784920","0.39500000","0.39500000","0.02193990","0.02193990","0.00000000","86.40650000","131906881.00000000","131906881.00000000","1.00000000","1.00000000"
"Dividend","CH0009107191","1170120969183.00000000","2630931783.00000000","1299781244.00000000","0.19427670","EUR","IE00B60SX063","SDJMID","0.00000000","EUR","2020-08-20","2020-08-21","2020-09-29","DE000LEG1110","LEGn.DE","LEG IMMOBILIEN","B9G6L89","EUR","1.00000000","3.60000000","3.60000000","0.09442870","0.09442870","0.00000000","86.40650000","69009836.00000000","69009836.00000000","1.00000000","1.00000000"
"Dividend","CH0009107191","1170120969183.00000000","2630931783.00000000","1299781244.00000000","0.19427670","EUR","IE00B60SX063","SDJMID","0.00000000","EUR","2020-08-20","2020-08-21","2020-09-29","GB00B1CRLC47","MNDI.L","MONDI","B1CRLC4","EUR","1.00000000","0.48750000","0.48750000","0.08371800","0.08371800","0.00000000","86.40650000","451807792.29000000","485553780.00000000","0.93050000","1.00000000"
"Dividend","CH0009107191","1170120969183.00000000","2630931783.00000000","1299781244.00000000","0.19427670","EUR","IE00B60SX063","SDJMID","0.00000000","EUR","2020-08-20","2020-08-21","2020-09-29","GB00BF8Q6K64","SLA.L","STANDARD LIFE ABERDEEN","BF8Q6K6","GBP","1.10784920","0.07300000","0.07300000","0.07012750","0.07012750","0.00000000","86.40650000","2281362920.00000000","2281362920.00000000","1.00000000","1.00000000"
"Dividend","CH0009107191","1170120969183.00000000","2630931783.00000000","1299781244.00000000","0.19427670","EUR","IE00B60SX063","SDJMID","0.00000000","EUR","2020-08-20","2020-08-21","2020-09-11","GB00B02L3W35","BKGH.L","BERKELEY GRP HLDG","B02L3W3","GBP","1.10784920","1.07000000","1.07000000","0.05663720","0.05663720","0.00000000","86.40650000","125703306.55180000","136648882.00000000","0.91990000","1.00000000"
"Dividend","CH0009107191","1170120969183.00000000","2630931783.00000000","1299781244.00000000","0.19427670","EUR","IE00B60SX063","SDJMID","0.00000000","EUR","2020-08-20",,,"GB00BKFB1C65","MNG.L","M&G","BKFB1C6","GBP","1.10784920","0.06000000","0.06000000","0.06235020","0.06235020","0.00000000","86.40650000","2467831597.20720000","2599906866.00000000","0.94920000","1.00000000"
"Dividend","CH0009107191","1170120969183.00000000","2630931783.00000000","1299781244.00000000","0.19427670","EUR","IE00B60SX063","SDJMID","0.00000000","EUR","2020-08-20","2020-08-21","2020-09-24","GB0002405495","SDR.L","SCHRODERS","0240549","GBP","1.10784920","0.35000000","0.35000000","0.01893740","0.01893740","0.00000000","86.40650000","128493734.40000000","226022400.00000000","0.56850000","1.00000000"
"Dividend","CH0009107191","1170120969183.00000000","2630931783.00000000","1299781244.00000000","0.19427670","EUR","IE00B60SX063","SDJMID","0.00000000","EUR","2020-08-20","2020-08-21","2020-09-21","GB00B0LCW083","HIK.L","HIKMA PHARMACEUTICALS","B0LCW08","USD","0.84030090","0.16000000","0.16000000","0.00728430","0.00728430","0.00000000","86.40650000","142542729.73350000","242543355.00000000","0.58770000","1.00000000"
"Dividend","CH0009107639","530054587742.00000000","1810557858.00000000","910152382.00000000","0.19094410","EUR","IE00B60SWZ49","SDJSML","0.00080510","EUR","2020-08-20","2020-08-21","2020-09-28","LU1072616219","BMEB.L","B&M EUROPEAN VALUE RETAIL","BMTRW10","GBP","1.10784920","0.05400000","0.04590000","0.02810840","0.02389210","0.00421630","55.90080000","850695579.87960000","1000582898.00000000","0.85020000","1.00000000"
"Dividend","CH0009107639","530054587742.00000000","1810557858.00000000","910152382.00000000","0.19094410","EUR","IE00B60SWZ49","SDJSML","0.00000000","EUR","2020-08-20","2020-08-21","2020-09-25","GB00BVFNZH21","ROR.L","ROTORK","BVFNZH2","GBP","1.10784920","0.03900000","0.03900000","0.02082510","0.02082510","0.00000000","55.90080000","872677658.00000000","872677658.00000000","1.00000000","1.00000000"
"Dividend","CH0009107639","530054587742.00000000","1810557858.00000000","910152382.00000000","0.19094410","EUR","IE00B60SWZ49","SDJSML","0.00000000","EUR","2020-08-20",,,"GB00B71N6K86","EVRE.L","EVRAZ","B71N6K8","USD","0.84030090","0.20000000","0.20000000","0.05406190","0.05406190","0.00000000","55.90080000","582423451.86040000","1506527294.00000000","0.38660000","1.00000000"
"Dividend","CH0009107639","530054587742.00000000","1810557858.00000000","910152382.00000000","0.19094410","EUR","IE00B60SWZ49","SDJSML","0.00025530","EUR","2020-08-20",,,"IE0033024807","UDG.L","UDG HEALTHCARE PUBLIC","3302480","USD","0.84030090","0.04460000","0.03345000","0.00534790","0.00401090","0.00133700","55.90080000","258360975.00000000","258360975.00000000","1.00000000","1.00000000"
"Dividend","CH0009107639","530054587742.00000000","1810557858.00000000","910152382.00000000","0.19094410","EUR","IE00B60SWZ49","SDJSML","0.00057090","EUR","2020-08-20",,,"IE0000669501","GL9.I","GLANBIA","4058629","EUR","1.00000000","0.10680000","0.08010000","0.01196040","0.00897030","0.00299010","55.90080000","202761688.97160000","296045684.00000000","0.68490000","1.00000000"
"Dividend","CH0100460879","1295952938011.00000000","637166896.00000000","412935825.00000000","0.14926410","EUR","IE00B5MJYY16","XDPS","0.04499140","EUR","2020-08-14","2020-08-17","2020-08-18","DK0060534915","NOVOb.CO","NOVO NORDISK B","BHC8X90","DKK","0.13426600","3.25000000","2.37250000","1.11637710","0.81495530","0.30142180","303.59270000","1630101714.76503000","1812564000.00000000","0.92900000","0.96806750"
"Dividend","CH0100461042","294591595206.00000000","406772566.00000000","204227028.00000000","0.19263970","EUR","IE00B5MTWH09","XEPS","0.01397910","EUR","2020-08-14","2020-08-17","2020-08-28","NO0010096985","EQNR.OL","EQUINOR","7133608","USD","0.84477300","0.09000000","0.06750000","0.29026490","0.21769870","0.07256620","139.51350000","1552971925.90020000","3338661219.00000000","0.33000000","1.40953970"
"Dividend","CH0100460572","227675488496.00000000","114209441.00000000","63254760.00000000","0.17463310","EUR","IE00B5MTWY73","XPPS","0.00000000","EUR","2020-08-13","2020-08-14","2020-09-11","JE00B5TT1872","CEY.L","CENTAMIN","B5TT187","USD","0.84713460","0.06000000","0.06000000","0.58004550","0.58004550","0.00000000","348.12920000","1303348018.33876000","1155955384.00000000","1.00000000","1.12750720"
"Dividend","CH0100460838","590427144115.00000000","229790232.00000000","147074895.00000000","0.15111310","EUR","IE00B5MTYL84","X3PS","0.00000000","EUR","2020-08-13","2020-08-14","2020-10-08","GB0002374006","DGE.L","DIAGEO","0237400","GBP","1.10588900","0.42470000","0.42470000","6.22707140","6.22707140","0.00000000","388.27310000","3046643295.40760000","2561988428.00000000","0.91230000","1.30348720"
"Dividend","CH0100460879","1304161681311.00000000","637166896.00000000","413505808.00000000","0.14905910","EUR","IE00B5MJYY16","XDPS","0.00000000","EUR","2020-08-13","2020-08-14","2020-09-14","GB0009895292","AZN.L","ASTRAZENECA","0989529","USD","0.84713460","0.90000000","0.90000000","1.33444940","1.33444940","0.00000000","305.09560000","1115219557.79546000","1312241922.00000000","1.00000000","0.84985820"
"Dividend","CH0100460879","1304161681311.00000000","637166896.00000000","413505808.00000000","0.14905910","EUR","IE00B5MJYY16","XDPS","0.00000000","EUR","2020-08-13","2020-08-14","2020-10-08","GB0009252882","GSK.L","GLAXOSMITHKLINE","0925288","GBP","1.10588900","0.19000000","0.19000000","1.48691180","1.48691180","0.00000000","305.09560000","4508927623.53585000","5384789156.00000000","0.93170000","0.89872840"
"Dividend","CH0100460911","975648039592.00000000","582395410.00000000","381110279.00000000","0.14782300","EUR","IE00B5MJYX09","XNPS","0.00000000","EUR","2020-08-13","2020-08-14","2020-09-11","GB0000536739","AHT.L","ASHTEAD GRP","0053673","GBP","1.10588900","0.33500000","0.33500000","0.29969350","0.29969350","0.00000000","247.63760000","471127943.08597300","454194833.00000000","1.00000000","1.03728160"
"Dividend","CH0100460911","975648039592.00000000","582395410.00000000","381110279.00000000","0.14782300","EUR","IE00B5MJYX09","XNPS","0.01069970","EUR","2020-08-13",,,"IE00B1RR8406","SKG.I","SMURFIT KAPPA GRP","B1RR828","EUR","1.00000000","0.80900000","0.60675000","0.28952760","0.21714570","0.07238190","247.63760000","208429607.89267100","238566266.00000000","0.93000000","0.93943650"
"Dividend","CH0100460952","433394258553.00000000","797689455.00000000","423099632.00000000","0.18237760","EUR","IE00B5MTXJ97","XIPS","0.00000000","EUR","2020-08-13","2020-08-14","2020-09-24","GB0005603997","LGEN.L","LEGAL & GENERAL GRP","0560399","GBP","1.10588900","0.04930000","0.04930000","0.36886060","0.36886060","0.00000000","99.08760000","5396816462.35625000","5965563767.00000000","1.00000000","0.90466160"
"Dividend","CH0100460952","433394258553.00000000","797689455.00000000","423099632.00000000","0.18237760","EUR","IE00B5MTXJ97","XIPS","0.00000000","EUR","2020-08-13","2020-08-14","2020-09-24","GB0002162385","AV.L","AVIVA","0216238","GBP","1.10588900","0.06000000","0.06000000","0.34412990","0.34412990","0.00000000","99.08760000","4137075214.81246000","3927666193.00000000","1.00000000","1.05331640"
"Dividend","CH0100460952","433394258553.00000000","797689455.00000000","423099632.00000000","0.18237760","EUR","IE00B5MTXJ97","XIPS","0.00000000","EUR","2020-08-13",,,"GB00BY9D0Y18","DLGD.L","DIRECT LINE INSURANCE GROUP","BY9D0Y1","GBP","1.10588900","0.07400000","0.07400000","0.15263130","0.15263130","0.00000000","99.08760000","1487764610.90444000","1364551605.00000000","1.00000000","1.09029560"
"Special Cash Dividend","CH0100460952","433394258553.00000000","797689455.00000000","423099632.00000000","0.18237760","EUR","IE00B5MTXJ97","XIPS","0.00000000","EUR","2020-08-13",,,"GB00BY9D0Y18","DLGD.L","DIRECT LINE INSURANCE GROUP","BY9D0Y1","GBP","1.10588900","0.14400000","0.14400000","0.29701230","0.29701230","0.00000000","99.08760000","1487764610.90444000","1364551605.00000000","1.00000000","1.09029560"
"Dividend","CH0100460952","433394258553.00000000","797689455.00000000","423099632.00000000","0.18237760","EUR","IE00B5MTXJ97","XIPS","0.00000000","EUR","2020-08-13",,,"GB00BGXQNP29","PHNX.L","PHOENIX GROUP HDG.","BGXQNP2","GBP","1.10588900","0.23400000","0.23400000","0.13010020","0.13010020","0.00000000","99.08760000","401036979.26675200","721526363.00000000","1.00000000","0.55581750"
"Dividend","CH0100461000","126730915183.00000000","214739468.00000000","126852844.00000000","0.16374070","EUR","IE00B5MTZ488","XMPS","0.00000000","EUR","2020-08-13","2020-08-14","2020-09-21","GB0006776081","PSON.L","PEARSON","0677608","GBP","1.10588900","0.06000000","0.06000000","0.28167030","0.28167030","0.00000000","96.63320000","911570091.56694400","752404738.00000000","1.00000000","1.21154220"
"Dividend","CH0100461042","297626526260.00000000","406772566.00000000","204720261.00000000","0.19217720","EUR","IE00B5MTWH09","XEPS","0.00000000","EUR","2020-08-13","2020-08-14","2020-09-25","GB0007980591","BP.L","BP","0798059","USD","0.84713460","0.05250000","0.05250000","1.76283280","1.76283280","0.00000000","140.61220000","16123193372.98310000","21415782350.00000000","0.94600000","0.79584040"
"Dividend","CH0100461083","696157627308.00000000","211026132.00000000","133132888.00000000","0.15333270","EUR","IE00B5MTZ595","XQPS","0.00000000","EUR","2020-08-13",,,"GB0003718474","GAW.L","GAMES WORKSHOP","0371847","GBP","1.10588900","0.30000000","0.30000000","0.05848920","0.05848920","0.00000000","505.83240000","37203068.49287940","32674839.00000000","1.00000000","1.13858460"
"Dividend","CH0009107191","1191195101667.00000000","2631411815.00000000","1300545753.00000000","0.19421610","EUR","IE00B60SX063","SDJMID","0.00331190","EUR","2020-08-13",,,"IE00B1RR8406","SKG.I","SMURFIT KAPPA GRP","B1RR828","EUR","1.00000000","0.80900000","0.60675000","0.06821060","0.05115790","0.01705270","87.91770000","221866627.38000000","238566266.00000000","0.93000000","1.00000000"
"Dividend","CH0009107191","1191195101667.00000000","2631411815.00000000","1300545753.00000000","0.19421610","EUR","IE00B60SX063","SDJMID","0.00000000","EUR","2020-08-13",,,"GB00BGXQNP29","PHNX.L","PHOENIX GROUP HDG.","BGXQNP2","GBP","1.10588900","0.23400000","0.23400000","0.07095630","0.07095630","0.00000000","87.91770000","721526363.00000000","721526363.00000000","1.00000000","1.00000000"
"Dividend","CH0009107191","1191195101667.00000000","2631411815.00000000","1300545753.00000000","0.19421610","EUR","IE00B60SX063","SDJMID","0.00000000","EUR","2020-08-13","2020-08-14","2020-09-21","GB0006776081","PSON.L","PEARSON","0677608","GBP","1.10588900","0.06000000","0.06000000","0.01897250","0.01897250","0.00000000","87.91770000","752404738.00000000","752404738.00000000","1.00000000","1.00000000"
"Dividend","CH0009107191","1191195101667.00000000","2631411815.00000000","1300545753.00000000","0.19421610","EUR","IE00B60SX063","SDJMID","0.00000000","EUR","2020-08-13",,,"GB00BY9D0Y18","DLGD.L","DIRECT LINE INSURANCE GROUP","BY9D0Y1","GBP","1.10588900","0.07400000","0.07400000","0.04243700","0.04243700","0.00000000","87.91770000","1364551605.00000000","1364551605.00000000","1.00000000","1.00000000"
"Special Cash Dividend","CH0009107191","1191195101667.00000000","2631411815.00000000","1300545753.00000000","0.19421610","EUR","IE00B60SX063","SDJMID","0.00000000","EUR","2020-08-13",,,"GB00BY9D0Y18","DLGD.L","DIRECT LINE INSURANCE GROUP","BY9D0Y1","GBP","1.10588900","0.14400000","0.14400000","0.08258010","0.08258010","0.00000000","87.91770000","1364551605.00000000","1364551605.00000000","1.00000000","1.00000000"
"Dividend","CH0009107639","539001138507.00000000","1810557858.00000000","910309772.00000000","0.19092660","EUR","IE00B60SWZ49","SDJSML","0.00000000","EUR","2020-08-13",,,"GB0003718474","GAW.L","GAMES WORKSHOP","0371847","GBP","1.10588900","0.30000000","0.30000000","0.00598730","0.00598730","0.00000000","56.83890000","32674839.00000000","32674839.00000000","1.00000000","1.00000000"