﻿"Dividend type","PR index ISIN","PR index CCY market cap","PR index CCY divisor","TR index CCY divisor","ETF/PR index ratio","ETF currency","ETF ISIN","ETF Bloomberg ticker","Dividend cost per share","Dividend cost per share CCY","Underlier ex date","Underlier record date","Underlier payment date","Underlier ISIN","Underlier RIC","Underlier name","Underlier sedol","Underlier Dividend CCY","Dividend FX rate","Gross dividend amount","Net dividend amount","Gross dividend points","Net dividend points","Dividend point difference","ETF NAV","Index composition quantity","Underlier total shares outstanding","Underlier float factor","Underlier cap factor"
"Dividend","CH0100460911","958248259501.00000000","584185332.00000000","386452400.00000000","0.14657960","EUR","IE00B5MJYX09","XNPS","0.00000000","EUR","2019-10-24",,,"JE00BJVNSS43","FERG.L","FERGUSON PLC","BJVNSS4","USD","0.89960420","1.45100000","1.45100000","0.51518900","0.51518900","0.00000000","240.43740000","230567622.08016200","232171182.00000000","1.00000000","0.99309320"
"Dividend","CH0100460911","958248259501.00000000","584185332.00000000","386452400.00000000","0.14657960","EUR","IE00B5MJYX09","XNPS","0.00000000","EUR","2019-10-24",,,"GB00B63H8491","RR.L","ROLLS ROYCE HLDG","B63H849","GBP","1.15888290","0.04600000","0.04600000","0.16459660","0.16459660","0.00000000","240.43740000","1803740745.02305000","1920005119.00000000","1.00000000","0.93944580"
"Dividend","CH0100460911","958248259501.00000000","584185332.00000000","386452400.00000000","0.14657960","EUR","IE00B5MJYX09","XNPS","0.00000000","EUR","2019-10-24",,,"GB0005576813","HWDN.L","HOWDEN JOINERY GRP","0557681","GBP","1.15888290","0.03900000","0.03900000","0.04855960","0.04855960","0.00000000","240.43740000","627655359.15525300","605613861.00000000","1.00000000","1.03639530"
"Dividend","CH0100461000","159699582579.00000000","227828266.00000000","136636274.00000000","0.16167860","EUR","IE00B5MTZ488","XMPS","0.00000000","EUR","2019-10-24","2019-10-25","2019-12-02","GB0033986497","ITV.L","ITV","3398649","GBP","1.15888290","0.02600000","0.02600000","0.59332940","0.59332940","0.00000000","113.33020000","4486323377.20403000","4025409194.00000000","1.00000000","1.11450120"
"Dividend","CH0009107191","1251614243831.00000000","2620764281.00000000","1313897432.00000000","0.19200020","EUR","IE00B60SX063","SDJMID","0.00000000","EUR","2019-10-24","2019-10-25","2019-12-02","GB0033986497","ITV.L","ITV","3398649","GBP","1.15888290","0.02600000","0.02600000","0.04628020","0.04628020","0.00000000","91.69550000","4025409194.00000000","4025409194.00000000","1.00000000","1.00000000"
"Dividend","CH0009107639","560709495077.00000000","1884214461.00000000","959409331.00000000","0.18906200","EUR","IE00B60SWZ49","SDJSML","0.00000000","EUR","2019-10-24",,,"GB0005576813","HWDN.L","HOWDEN JOINERY GRP","0557681","GBP","1.15888290","0.03900000","0.03900000","0.01452680","0.01452680","0.00000000","56.26110000","605613861.00000000","605613861.00000000","1.00000000","1.00000000"
"Dividend","CH0009107639","560709495077.00000000","1884214461.00000000","959409331.00000000","0.18906200","EUR","IE00B60SWZ49","SDJSML","0.00000000","EUR","2019-10-24","2019-10-25","2019-11-15","GB0009633180","DPH.L","DECHRA PHARMACEUTICALS","0963318","GBP","1.15888290","0.22100000","0.22100000","0.01395300","0.01395300","0.00000000","56.26110000","102651602.00000000","102651602.00000000","1.00000000","1.00000000"
"Dividend","CH0009107639","560709495077.00000000","1884214461.00000000","959409331.00000000","0.18906200","EUR","IE00B60SWZ49","SDJSML","0.00000000","EUR","2019-10-24","2019-10-25","2019-12-06","GB0000961622","BALF.L","BALFOUR BEATTY","0096162","GBP","1.15888290","0.02100000","0.02100000","0.00890870","0.00890870","0.00000000","56.26110000","689739619.00000000","689739619.00000000","1.00000000","1.00000000"
"Cash Dividend","DE000SLA33Z2","174334081.37346300","994271.54545900","853406.18527800","0.11581030","EUR","IE00BDFB5922","PFTB","0.00262620","EUR","2019-10-24","2019-10-25","2019-10-28","CH0011795959","DOKA.S","DORMAKABA HOLDING AG","7050417","CHF","0.90834770","16.00000000","10.40000000","0.06479060","0.04211390","0.02267670","20.30600000","4432.50331740","1.00000000","1.00000000","1.00000000"
